Blog
FAQ
Discussions
Search
Projects, issues, users, and merge requests.
Project ID, name, and description.
User nickname, name, and org.
Issue ID, title, and summary.
Merge request titles.
Contrib
.social
Feed
Live feed
Builds
Live builds
Core
Tags
Tags and Initiatives
Navigation
Projects
Drupal core
Other
Open on Drupal.org →
Follow
Sign in to follow projects
Issues
📌
Improve doc block for Unicode::truncate()
Needs work
other
Created
almost 12 years ago
v11.0
🇩🇪
Germany
ro-no-lo
1 day ago
📌
Fix 'Drupal.Commenting.DocComment.MissingShort' coding standard
Active
other
Created
about 5 years ago
v11.0
🇨🇳
China
jungle
1 day ago
🌱
[policy, no patch] Define usage heuristics for browser support
Active
other
Created
over 5 years ago
v10.1
🇬🇧
United Kingdom
catch
2 days ago
🌱
Remove usage of "blacklist", "whitelist", use better terms instead
Needs work
other
Created
over 6 years ago
v11.0
🇺🇸
United States
DamienMcKenna
2 days ago
🌱
[Meta] Fix 'Drupal.Commenting.FunctionComment' coding standard
Active
other
Created
over 9 years ago
v11.0
🇧🇪
Belgium
attiks
2 days ago
🌱
Towards a Versionless Drupal
Active
other
Created
about 1 year ago
v11.0
🇺🇸
United States
ivanstegic
3 days ago
📌
Matching Question Not Evaluated in Quiz Results
Active
other
Created
11 months ago
v9.5
vinaya96
4 days ago
📌
[INGORE] testissue
Postponed: needs info
other
Created
11 months ago
v11.0
🇳🇱
Netherlands
bbrala
5 days ago
🐛
vary header from response is removed by CorsService.php
Active
other
Created
7 months ago
v10.2
🇮🇳
India
drupalite1411
6 days ago
🌱
[meta] Known intermittent, random, and environment-specific test failures
Active
other
Created
over 8 years ago
v10.1
🇺🇸
United States
xjm
6 days ago
🐛
Incorrect translatable string in FileTransferAuthorizeForm
Active
other
Created
over 1 year ago
v11.0
🇷🇺
Russia
Chi
10 days ago
📌
Mentoring Playground Issue - Used only for experimentation and training
Active
base system
Created
11 months ago
v11.0
🇺🇸
United States
rfay
10 days ago
📌
Review/update $adminTags variable for new html elements to be whitelisted
Needs work
other
Created
over 8 years ago
v10.1
🇺🇸
United States
nmillin
11 days ago
📌
Misspellings in schema files
Active
other
Created
about 1 year ago
v11.0
🇳🇿
New Zealand
quietone
11 days ago
📌
Fix 'Drupal.Commenting.DocComment.ShortNotCapital' coding standard
Postponed
other
Created
over 7 years ago
v11.0
🇷🇴
Romania
mfernea
12 days ago
📌
Replace http://example.com with https://example.com in core
Active
other
Created
9 months ago
v11.0
🇺🇸
United States
mikelutz
12 days ago
📌
Fix PHPStan L2 error in traits
Needs work
other
Created
over 2 years ago
v10.1
🇧🇪
Belgium
mallezie
12 days ago
✨
Strengthening Drupal: Protecting Content from AI Scrapers and Bots
Active
other
Created
9 months ago
v11.0
JoAMoS
13 days ago
🌱
[meta] Fix PHP coding standards in core
Active
other
Created
over 9 years ago
v10.1
🇧🇬
Bulgaria
pfrenssen
15 days ago
🐛
\Drupal::messenger() changed behaviour between Drupal 10.2.7 and Drupal 10.3.0
Active
other
Created
9 months ago
v10.3
sboden
17 days ago
📌
[Plan] Simplify core component list
Active
other
Created
over 1 year ago
v11.0
🇳🇿
New Zealand
quietone
18 days ago
🐛
Duplicated test method name in in-line comment
Active
documentation
Created
over 1 year ago
v11.0
🇧🇷
Brazil
ashley_herodev
18 days ago
📌
[Ignore] Patch testing for chrisck
Closed: works as designed
other
Created
over 3 years ago
v9.3
🇨🇦
Canada
chrisck
19 days ago
📌
Fix 'Drupal.Files.LineLength' coding standard
Needs work
other
Created
over 9 years ago
v10.1
🇧🇪
Belgium
attiks
19 days ago
📌
Fix 'Drupal.Commenting.InlineComment.InvalidEndChar' coding standard
Postponed
other
Created
almost 9 years ago
v11.0
🇫🇷
France
andypost
20 days ago
📌
[PP-1] Enable 'Drupal.Commenting.VariableComment.MissingVar' coding standard
Postponed
other
Created
over 7 years ago
v11.0
🇷🇴
Romania
mfernea
20 days ago
📌
Fix 'Drupal.Semantics.ConstantName.ConstantStart' coding standard
Needs review
search.module
Created
almost 9 years ago
v10.1
🇺🇸
United States
mile23
20 days ago
🌱
[policy] Default to requiring the latest stable PHP release available when a new major version reaches beta
Active
other
Created
over 1 year ago
v11.0
🇬🇧
United Kingdom
catch
23 days ago
🌱
[meta] Fix 'Drupal.Commenting.DocComment' coding standard
Active
other
Created
8 months ago
v11.0
🇳🇿
New Zealand
quietone
24 days ago
📌
Keep all sniffs in phpcs.xml.dist in sync with the list got from the locked version of coder
Needs work
other
Created
almost 5 years ago
v10.1
🇨🇳
China
jungle
26 days ago
🐛
cspell complains about phpcs sniff name
Active
other
Created
8 months ago
v11.0
🇺🇸
United States
tr
28 days ago
📌
[META] Replace t() calls inside of classes
Active
other
Created
about 5 years ago
v10.1
🇫🇷
France
andypost
29 days ago
📌
[meta] Remove usage of t() in tests not testing translation
Active
other
Created
almost 5 years ago
v10.1
🇪🇸
Spain
manuel garcia
29 days ago
🐛
container not initialized yet
Active
other
Created
about 1 year ago
v10.2
🇺🇸
United States
bobburns
about 1 month ago
📌
Fix 'Generic.CodeAnalysis.UselessOverridingMethod' coding standard
Active
other
Created
about 5 years ago
v9.5
🇨🇳
China
jungle
about 1 month ago
💬
Drupal\Component\Plugin\Exception\PluginNotFoundException: The "" entity type does not exist. in Drupal\Core\Entity\EntityTypeManager->getDefinition() (line 150 of /var/www/stage-community/web/core/lib/Drupal/Core/Entity/EntityTypeManager.php)
Closed: duplicate
other
Created
over 4 years ago
v8.9
Ana Luiza
about 1 month ago
🌱
[meta] Fix 'Drupal.Commenting.VariableComment' coding standard
Active
other
Created
over 7 years ago
v11.0
🇷🇴
Romania
mfernea
about 1 month ago
🌱
Fix DrupalPractice.CodeAnalysis.VariableAnalysis
Active
other
Created
about 2 years ago
v10.1
🇳🇿
New Zealand
quietone
about 1 month ago
📌
Require short ternary (Elvis operator) syntax
Active
other
Created
about 1 year ago
v11.0
🇦🇺
Australia
mstrelan
about 1 month ago
🐛
Deprecated function: dirname(): Passing null to parameter #1 ($path) of type string is deprecated
Needs work
other
Created
about 3 years ago
v9.5
🇪🇬
Egypt
Mok7tar
about 1 month ago
🌱
[12.x] [meta] Release Drupal 12 in 2026
Active
other
Created
11 months ago
v11.0
🇺🇸
United States
xjm
about 1 month ago
🌱
[meta] Drupal modernization
Active
other
Created
9 months ago
v11.0
🇬🇧
United Kingdom
catch
about 1 month ago
🐛
InvalidArgumentException: "0" is an invalid render array key
Active
other
Created
7 months ago
v10.3
harikumar_prft
about 2 months ago
🐛
Dialog button/inputs not visible when open details element
Active
other
Created
8 months ago
v11.0
🇩🇪
Germany
tobiasb
about 2 months ago
🌱
DrupalCon Barcelona 2015 major issue triage
Active
other
Created
12 months ago
v8.7
🇺🇸
United States
xjm
about 2 months ago
📌
Fix 'Drupal.Commenting.DocComment.ParamNotFirst' coding standard
Active
other
Created
about 7 years ago
v11.0
🇳🇿
New Zealand
eltori
about 2 months ago
🐛
Detect and remove vendor directory if any in theme folder which causes theme render issues
Active
other
Created
about 1 year ago
v11.0
🇮🇳
India
pemson18
about 2 months ago
📌
Replace url usage of http://www.w3.org with https://www.w3.org in core
Active
other
Created
9 months ago
v11.0
🇺🇸
United States
mikelutz
about 2 months ago
📌
Replace @inheritdoc annotations with #[\Override]
Active
other
Created
12 months ago
v11.0
🇺🇸
United States
bradjones1
about 2 months ago
📌
Run CSpell on all files when CSpell-related files change
Active
other
Created
about 2 years ago
v10.1
🇳🇱
Netherlands
spokje
about 2 months ago
📌
Automated A11y tests in PHPUnit
Active
other
Created
about 2 years ago
v10.1
🇫🇷
France
duaelfr
about 2 months ago
📌
[policy review 2024-10] Testing core gate, heuristics section
Active
other
Created
12 months ago
v11.0
🇳🇿
New Zealand
quietone
about 2 months ago
📌
Subsystem maintainer permissions on gitlab
Active
other
Created
over 1 year ago
v11.0
🇳🇱
Netherlands
bbrala
about 2 months ago
✨
Add eco-friendly scripts to reduce disk usage
Active
other
Created
over 1 year ago
v11.0
matthieuscarset
about 2 months ago
💬
The "node_type" plugin does not exist - upgrade from D9 to D10
Active
node system
Created
almost 2 years ago
v10.0
🇺🇸
United States
tcgak1_carroll
2 months ago
📌
Fix Drupal.Commenting.FunctionComment.TypeHintMissing
Active
other
Created
about 5 years ago
v11.0
🇮🇳
India
hash6
2 months ago
🌱
[meta] Release preparation steps for 11.1.0 and 10.4.0
Active
other
Created
10 months ago
v11.0
🇺🇸
United States
xjm
2 months ago
🌱
[META] Provide modern replacements for and deprecate the legacy include files
Active
other
Created
over 5 years ago
v10.1
🇺🇦
Ukraine
voleger
2 months ago
🐛
Fix remaining VariableComment.MissingVar annotation
Needs work
other
Created
over 7 years ago
v10.1
🇳🇴
Norway
zaporylie
2 months ago
📌
Convert code blocks in comments using array() syntax to @code/@endcode
Active
other
Created
10 months ago
v11.0
🇳🇿
New Zealand
quietone
2 months ago
🌱
[12.x] [meta] Deprecate dependencies, libraries, modules, and themes that will be removed from Drupal 12 core
Active
other
Created
8 months ago
v11.0
🇺🇸
United States
xjm
2 months ago
📌
Reintroduce "Crawl-delay" in robots.txt
Active
other
Created
over 8 years ago
v11.0
🇫🇮
Finland
Antti J. Salminen
2 months ago
📌
bnjmnm pb build
Active
other
Created
about 2 years ago
v10.1
🇺🇸
United States
bnjmnm
2 months ago
🐛
Drupal returns 500 Error instead of 403
Active
other
Created
8 months ago
v10.3
🇺🇦
Ukraine
pifagor
2 months ago
📌
In PagerPluginBase Rename Views properties to core standards
Needs work
views.module
Created
about 11 years ago
v10.1
🇺🇦
Ukraine
bohart
2 months ago
📌
Use t() for #title and #description in tests and test modules
Needs work
phpunit
Created
over 4 years ago
v10.1
🇮🇳
India
shaktik
2 months ago
📌
[policy, no patch] relax patch size policies
Active
other
Created
about 1 year ago
v11.0
🇦🇺
Australia
acbramley
2 months ago
💬
Drupal migrate: Update some fields on all users of drupal.
Active
other
Created
over 1 year ago
v9.5
🇻🇳
Vietnam
elnavut
2 months ago
✨
[pp-upstream] Use PHPStan for deprecation checking
Postponed
other
Created
about 3 years ago
v10.0
🇧🇪
Belgium
mallezie
2 months ago
📌
Removed unused class property $translationFilesDirectory
Active
other
Created
over 6 years ago
v9.5
🇩🇪
Germany
tstoeckler
3 months ago
📌
Fix DrupalPractice.Objects.GlobalFunction in test Forms
Active
other
Created
8 months ago
v11.0
🇳🇿
New Zealand
quietone
3 months ago
🌱
[Policy, no patch] closing older issues
Active
other
Created
about 1 year ago
v11.0
🇺🇸
United States
smustgrave
3 months ago
📌
Fix more var and param docs identified by phpstan
Active
other
Created
7 months ago
v11.0
🇦🇺
Australia
mstrelan
3 months ago
🌱
[meta] Improve issue management
Active
other
Created
about 2 years ago
v10.1
🇳🇿
New Zealand
quietone
3 months ago
📌
11.1.0 release notes
Postponed
other
Created
10 months ago
v11.0
🇺🇸
United States
xjm
3 months ago
📌
10.4.0 release notes
Postponed
other
Created
10 months ago
v11.0
🇺🇸
United States
xjm
3 months ago
💬
Critical Error/Access Logs Suddenly in Chinese/Can't Access Site to Troubleshoot
Active
configuration system
Created
11 months ago
v10.2
🇺🇸
United States
edboost
3 months ago
💬
Support help question... how to get the stacked layouts
Active
other
Created
about 1 year ago
v10.3
🇺🇸
United States
HeneryH
3 months ago
📌
Fix 'Drupal.Commenting.VariableComment.VarOrder' coding standard
Postponed
other
Created
over 7 years ago
v11.0
🇷🇴
Romania
mfernea
3 months ago
📌
Fix strict type errors detected by phpstan
Active
other
Created
over 1 year ago
v11.0
🇦🇺
Australia
mstrelan
3 months ago
📌
[Ignore] In space (and/or this issue), no one can hear patches scream IX
Active
other
Created
over 1 year ago
v11.0
🇳🇱
Netherlands
spokje
3 months ago
🌱
[META] Make Drupal 7 core compatible with PHP 8.3
Active
other
Created
over 1 year ago
v7.0
🇨🇦
Canada
Liam Morland
3 months ago
📌
Fix 'Drupal.Semantics.FunctionT.NotLiteralString' coding standard
Active
other
Created
about 5 years ago
v11.0
🇨🇳
China
jungle
3 months ago
📌
Fix Drupal.Commenting.FunctionComment.InvalidNoReturn
Needs review
base system
Created
almost 9 years ago
v11.0
🇺🇸
United States
anoopjohn
3 months ago
📌
Convert use of array() syntax in sentences
Active
other
Created
10 months ago
v11.0
🇳🇿
New Zealand
quietone
3 months ago
📌
Fix Drupal.Commenting.DocComment.SpacingBeforeTags coding standard
Postponed
other
Created
about 8 years ago
v11.0
🇬🇧
United Kingdom
timmillwood
3 months ago
📌
Fix return type
Active
other
Created
over 1 year ago
v11.0
🇳🇿
New Zealand
quietone
3 months ago
🌱
[meta] Requirements for tagging 11.1.0-beta1 and 10.4.0-beta1
Active
other
Created
8 months ago
v11.0
🇺🇸
United States
xjm
3 months ago
📌
Add sniffs for @see, @throw and styling
Active
other
Created
11 months ago
v11.0
🇳🇿
New Zealand
quietone
4 months ago
📌
Fiex spelling of 3 'base' words
Active
other
Created
7 months ago
v11.0
🇳🇿
New Zealand
quietone
4 months ago
📌
Enable Drupal.NamingConventions.ValidVariableName.LowerCamelName
Active
other
Created
12 months ago
v11.0
🇳🇿
New Zealand
quietone
4 months ago
📌
Fix spelling of some words with 'un' prefix
Active
other
Created
over 1 year ago
v11.0
🇳🇿
New Zealand
quietone
4 months ago
📌
Fix spelling for 10 words used in tests
Active
other
Created
10 months ago
v11.0
🇳🇿
New Zealand
quietone
4 months ago
📌
File mime type and other file related words in the dictionary
Active
other
Created
about 1 year ago
v11.0
🇳🇿
New Zealand
quietone
4 months ago
📌
Fix 12 'un' words
Active
other
Created
about 1 year ago
v11.0
🇳🇿
New Zealand
quietone
4 months ago
📌
Correct mymodule, mydriver and anothermodule
Active
other
Created
about 1 year ago
v11.0
🇳🇿
New Zealand
quietone
4 months ago
📌
Fix more words that are only misspelled in comments
Active
other
Created
over 1 year ago
v11.0
🇳🇿
New Zealand
quietone
4 months ago
📌
Get dictionary.txt back in sync
Active
other
Created
over 1 year ago
v11.0
🇳🇿
New Zealand
quietone
4 months ago
📌
Fix non-english words in tests
Active
other
Created
over 1 year ago
v11.0
🇳🇿
New Zealand
quietone
4 months ago
📌
Fix Drupal.Semantics.FunctionTriggerError coding standard
Needs work
other
Created
almost 6 years ago
v10.0
🇬🇧
United Kingdom
jonathan1055
4 months ago
📌
[meta] Priorities for 2024-12-04 release of Drupal 7
Active
other
Created
10 months ago
v7.0
🇸🇰
Slovakia
poker10
4 months ago
📌
Fix spelling of words only misspelled in tests, variable name, part 5
Active
other
Created
over 1 year ago
v11.0
🇳🇿
New Zealand
quietone
4 months ago
📌
Fix @return type, documentation only
Active
other
Created
over 1 year ago
v11.0
🇳🇿
New Zealand
quietone
4 months ago
📌
10.4.0-rc1 release notes
Postponed
other
Created
10 months ago
v11.0
🇺🇸
United States
xjm
4 months ago
📌
11.1.0-rc1 release notes
Postponed
other
Created
10 months ago
v11.0
🇺🇸
United States
xjm
4 months ago
📌
10.4.0-beta1 release notes
Postponed
other
Created
10 months ago
v11.0
🇺🇸
United States
xjm
4 months ago
📌
11.1.0-beta1 release notes
Postponed
other
Created
10 months ago
v11.0
🇺🇸
United States
xjm
4 months ago
📌
Clean cspell:ignore lines and rebuild dictionary
Active
other
Created
about 1 year ago
v11.0
🇳🇿
New Zealand
quietone
4 months ago
📌
[ignore] testing issue
Active
other
Created
over 2 years ago
v11.0
🇳🇿
New Zealand
quietone
4 months ago
🌱
Prevent 'downgrades' from maintenance minors to older minor releases for the next major version
Active
other
Created
9 months ago
v11.0
🇬🇧
United Kingdom
catch
4 months ago
📌
Hardcode security coverage EOL dates for Drupal 10.last-1 and 10.last
Postponed
other
Created
over 1 year ago
v9.4
🇳🇿
New Zealand
quietone
4 months ago
🌱
[plan] Service traits should require IoC injection
Active
other
Created
almost 9 years ago
v11.0
🇺🇸
United States
mile23
4 months ago
🌱
[meta] Deprecate tarballs, because they are incompatible with Composer-managed dependencies, Automatic Updates, Project Browser, and release managers' health
Active
other
Created
almost 3 years ago
v11.0
🇺🇸
United States
xjm
4 months ago
📌
10.4.0-rc1 release notes
Postponed
other
Created
10 months ago
v11.0
🇺🇸
United States
xjm
4 months ago
📌
11.1.0-alpha1 release notes
Postponed
other
Created
10 months ago
v11.0
🇺🇸
United States
xjm
4 months ago
🌱
[meta] Release Drupal 11, possibly in 2024
Active
other
Created
about 3 years ago
v11.0
🇺🇸
United States
xjm
4 months ago
📌
Remove remaining unnecessary uses of t() in tests
Active
other
Created
over 1 year ago
v11.0
🇬🇧
United Kingdom
longwave
4 months ago
📌
Ignore: patch testing issue
Active
system.module
Created
over 5 years ago
v10.1
🇦🇺
Australia
dpi
4 months ago
🌱
[policy] Decide on format of commit message
Active
other
Created
12 months ago
v11.0
🇳🇿
New Zealand
quietone
4 months ago
🐛
Nightwatch tests cannot run within lando environment
Active
other
Created
7 months ago
v10.4
🇺🇸
United States
cpierce42
5 months ago
💬
xjm dealing with organization credit attribution limitations
Postponed
other
Created
over 1 year ago
v11.0
🇺🇸
United States
xjm
5 months ago
📌
[IGNORE] Testing Patch
Active
other
Created
about 2 years ago
v10.1
🇮🇳
India
Aziza Anwari
5 months ago
💬
JS conflicts when logged in
Active
other
Created
over 1 year ago
v10.1
🇺🇸
United States
hcanning
5 months ago
💬
The provided host name is not valid for this server.
Active
other
Created
over 1 year ago
v10.2
🇬🇧
United Kingdom
freelylw
5 months ago
💬
The website encountered an unexpected error. Drupal\Component\Plugin\Exception\PluginNotFoundException: The "entity_bundle:node"
Active
other
Created
9 months ago
v10.3
🇬🇧
United Kingdom
freelylw
5 months ago
📌
Branch 11.2.x
Postponed
other
Created
10 months ago
v11.0
🇺🇸
United States
xjm
5 months ago
📌
Branch 10.5.x
Postponed
other
Created
10 months ago
v11.0
🇺🇸
United States
xjm
5 months ago
📌
[META] Fix @todo items referencing closed issues
Active
other
Created
about 5 years ago
v9.5
🇺🇸
United States
bnjmnm
5 months ago
📌
Several comments have sentences with extra periods at the end
Postponed
other
Created
about 5 years ago
v11.0
🇺🇦
Ukraine
Amsteri
5 months ago
📌
[plach] Testing issue
Closed: outdated
other
Created
about 7 years ago
v10.1
🇮🇹
Italy
plach
5 months ago
✨
Enforce return types in all new methods and functions
RTBC
other
Created
9 months ago
v11.0
🇦🇺
Australia
mstrelan
5 months ago
✨
Support priority for needs_destruction service tag
Needs work
other
Created
about 6 years ago
v10.1
🇧🇪
Belgium
Grayle
5 months ago
📌
Use sniff DrupalPractice.CodeAnalysis.VariableAnalysis on */tests/*
Needs work
other
Created
over 3 years ago
v10.1
🇳🇱
Netherlands
spokje
5 months ago
📌
Add a 'key-value system' component to the core project node so that issues can be filed against it and searched
RTBC
other
Created
almost 7 years ago
v10.1
🇫🇷
France
fgm
5 months ago
📌
Make the nightwatch tests work with MongoDB
Needs review
other
Created
7 months ago
v11.0
🇳🇱
Netherlands
daffie
5 months ago
📌
Update standard profile to use field_body
Postponed
other
Created
11 months ago
v11.0
🇦🇺
Australia
sime
5 months ago
📌
Variable::export should export use short-hand array syntax
Needs work
other
Created
almost 7 years ago
v11.0
🇦🇺
Australia
Sam152
5 months ago
📌
In Class ViewExecutable Rename Views properties to core standards
Needs work
other
Created
over 11 years ago
v10.1
🇻🇳
Vietnam
mrsinguyen
5 months ago
📌
[Meta] Bug Smash Initiative monthly triage meta commencing 2024-09-10
Active
other
Created
7 months ago
v11.0
🇺🇸
United States
smustgrave
5 months ago
📌
[Followup] Fix Drupal.Commenting.FunctionComment.MissingReturnType returns for NULL
Active
other
Created
over 2 years ago
v11.0
🇳🇱
Netherlands
bbrala
5 months ago
📌
Test issue please ignore
Active
other
Created
over 2 years ago
v9.5
🇮🇳
India
nikhil_110
5 months ago
📌
[Meta] Remove spelling errors from dictionary.txt and fix them
Active
other
Created
about 5 years ago
v11.0
🇨🇳
China
jungle
5 months ago
📌
Fix callables that are expected to return bool but don't
RTBC
other
Created
7 months ago
v11.0
🇦🇺
Australia
mstrelan
6 months ago
📌
Adopt ekino/phpstan-banned-code and use it to prevent usage of uniqid()
Active
other
Created
over 1 year ago
v11.0
🇮🇹
Italy
mondrake
6 months ago
📌
Fix return type in \Drupal\Core\Database\Query\Merge::__toString
RTBC
other
Created
over 1 year ago
v11.0
🇳🇿
New Zealand
quietone
6 months ago
✨
Provide cache tags which are invalidated when a state variable changes.
Needs work
other
Created
about 3 years ago
v11.0
🇨🇦
Canada
alberto56
6 months ago
✨
Remove auto added empty field from multiple values field.
Needs work
other
Created
over 2 years ago
v11.0
🇨🇳
China
Omega_yang
6 months ago
📌
[ignore] Patch Testing Only
Active
other
Created
almost 4 years ago
v10.1
🇮🇳
India
vsujeetkumar
6 months ago
📌
Rebuild dictionary.txt
Active
other
Created
11 months ago
v11.0
🇳🇿
New Zealand
quietone
6 months ago
📌
Change string 'Modules to enable' that are not in comments
RTBC
other
Created
7 months ago
v11.0
🇳🇿
New Zealand
quietone
6 months ago
📌
Enable Drupal.Commenting.FunctionComment.InvalidNoReturn
Postponed
other
Created
over 1 year ago
v11.0
🇳🇿
New Zealand
quietone
6 months ago
📌
Audit usages of icons and delete unused icons
RTBC
other
Created
over 2 years ago
v11.0
🇫🇮
Finland
lauriii
6 months ago
📌
Add Tugboat configuration to core
RTBC
other
Created
almost 3 years ago
v11.0
🇪🇸
Spain
juampynr
6 months ago
🐛
ContextAwarePluginAssignmentTrait only allows contexts currently available via constraints
Postponed: needs info
other
Created
about 5 years ago
v11.0
🇺🇸
United States
malcolm_p
6 months ago
🐛
Impossible to translate "ago" for "timestamp_ago" formatter
Active
other
Created
over 1 year ago
v11.0
🇺🇦
Ukraine
SV
6 months ago
🐛
Custom Drush Commands Not Recognized After Upgrading to Drush 12.4.3
Postponed: needs info
other
Created
7 months ago
v10.2
🇹🇳
Tunisia
drupaldevGirl
6 months ago
📌
Drupal on MongoDB (the full PR)
Active
other
Created
over 1 year ago
v11.0
🇳🇱
Netherlands
daffie
6 months ago
✨
Investigate using git-restore-mtime package for cacheing
Active
other
Created
8 months ago
v11.0
🇳🇱
Netherlands
bbrala
6 months ago
📌
Move test_entity names to drupal-dict
Fixed
other
Created
8 months ago
v11.0
🇳🇿
New Zealand
quietone
6 months ago
🐛
Amsi.Edge.22.BB7B4DF6 flagged as malicious resource
Active
other
Created
9 months ago
v10.3
🇬🇧
United Kingdom
Razor Smile
6 months ago
📌
[Meta] Bug Smash Initiative monthly triage meta commencing 2024-08-13
Fixed
other
Created
8 months ago
v11.0
🇦🇺
Australia
griffynh
6 months ago
📌
[Meta] Bug Smash Initiative monthly triage meta commencing 2024-06-11
Fixed
other
Created
10 months ago
v11.0
🇦🇺
Australia
griffynh
6 months ago
📌
[Meta] Bug Smash Initiative monthly triage meta commencing 2024-07-09
Fixed
other
Created
9 months ago
v11.0
🇦🇺
Australia
griffynh
6 months ago
📌
Add ignore for some words used in tests
Fixed
other
Created
7 months ago
v11.0
🇳🇿
New Zealand
quietone
7 months ago
🌱
Deprecate dependencies, libraries, modules, and themes that will be removed from Drupal 11 core
Fixed
other
Created
about 3 years ago
v11.0
🇺🇸
United States
xjm
7 months ago
🐛
Change 'readiness' check text
Active
other
Created
7 months ago
v11.0
🇳🇿
New Zealand
quietone
7 months ago
🐛
Status report messages for AU
Active
other
Created
7 months ago
v11.0
🇳🇿
New Zealand
quietone
7 months ago
📌
Ignore, testing issue
Needs work
other
Created
over 1 year ago
v11.0
🇮🇹
Italy
mondrake
7 months ago
🐛
Content Dashboard needs some headings
Closed: cannot reproduce
other
Created
almost 3 years ago
v11.0
mweiler
7 months ago
✨
maintenance mode content avilable at example.com/user
Closed: works as designed
other
Created
over 8 years ago
v11.0
Benia
7 months ago
📌
Create a faster autoloader
Postponed: needs info
other
Created
almost 10 years ago
v11.0
🇩🇪
Germany
Fabianx
7 months ago
🐛
Log filling up with User 1 IP addresse access denied
Closed: works as designed
other
Created
7 months ago
v10.3
🇺🇸
United States
corE
7 months ago
📌
Remove misc usage of whitelist in tests and comments
Fixed
other
Created
7 months ago
v11.0
🇳🇿
New Zealand
quietone
7 months ago
📌
Missing @var annotation for properties that provide default values
Fixed
other
Created
8 months ago
v10.4
🇳🇿
New Zealand
quietone
7 months ago
🐛
Unable to add content (article or basic page), get HTTP 500 error, able to add other content types
Closed: cannot reproduce
other
Created
almost 2 years ago
v11.0
🇩🇴
Dominican Republic
constantsearcher
7 months ago
📌
Error in ExtensionList when switching to read only DB user
Closed: won't fix
other
Created
about 3 years ago
v11.0
s_leu
7 months ago
📌
Error in WriteSafeSessionHandler when switching to read only DB user
Closed: won't fix
other
Created
about 3 years ago
v11.0
s_leu
7 months ago
✨
[Meta] Running Drupal with read only DB user (working title)
Closed: won't fix
other
Created
about 3 years ago
v11.0
s_leu
7 months ago
🐛
Error in TwigEnvironment when switching to read only DB user
Closed: works as designed
other
Created
about 3 years ago
v11.0
s_leu
7 months ago
📌
[policy, no patch] Decide policy related to use of novice tag
Active
other
Created
7 months ago
v11.0
🇺🇸
United States
cmlara
7 months ago
📌
open-telemetry/sem-conv:1.27.0 introduces new deprecation, breaks daily updated deps run
Fixed
other
Created
7 months ago
v10.4
🇳🇱
Netherlands
spokje
7 months ago
📌
Replace use of whitelist/blacklist in the path_alias module
Fixed
other
Created
almost 5 years ago
v11.0
🇬🇧
United Kingdom
alexpott
7 months ago
📌
[ignore] mxr576's core patch playground
Needs work
other
Created
over 3 years ago
v11.0
🇭🇺
Hungary
mxr576
7 months ago
📌
Change string 'Modules to enable' to {@inheritdoc} in comments
Fixed
other
Created
8 months ago
v10.3
🇳🇿
New Zealand
quietone
7 months ago
📌
Forbid use of 'A-z' pattern in regular expressions
Closed: outdated
other
Created
almost 8 years ago
v11.0
mbkaba22
7 months ago
📌
Add an Accessibility Conformance Report (ACR) to Core
Active
other
Created
about 2 years ago
v11.0
🇨🇦
Canada
mgifford
7 months ago
📌
All modules: update the URL’s which has been shifted to https from http
Closed: outdated
other
Created
over 3 years ago
v11.0
🇮🇳
India
gauravvvv
7 months ago
📌
Fix DrupalPractice.Objects.GlobalFunction in ListBuilders
Fixed
other
Created
8 months ago
v10.4
🇳🇿
New Zealand
quietone
7 months ago
🐛
Fix param docs identified by phpstan
Fixed
other
Created
9 months ago
v10.3
🇦🇺
Australia
mstrelan
7 months ago
📌
Update MaintenanceMode service and deprecate legacy API
Needs work
other
Created
almost 6 years ago
v11.0
🇺🇦
Ukraine
voleger
7 months ago
💬
simplesamlphp: Drupal configured as IDP need to send Logout as post
Closed: outdated
other
Created
7 months ago
v9.5
🇺🇸
United States
kdmdrupal
7 months ago
📌
Fix 9 spelling words in tests
Fixed
other
Created
8 months ago
v11.0
🇳🇿
New Zealand
quietone
7 months ago
📌
Remove misuses of t() function
Closed: duplicate
other
Created
over 9 years ago
v11.0
🇫🇮
Finland
lauriii
7 months ago
📌
Add blacklist and whitelist to the list of flagwords
Postponed
other
Created
7 months ago
v11.0
🇳🇿
New Zealand
quietone
7 months ago
📌
Consider allowing multiple workflow transitions with the same from and to states
Active
other
Created
about 8 years ago
v11.0
🇩🇪
Germany
tstoeckler
7 months ago
📌
Enable Drupal.Commenting.VariableComment.IncorrectVarType
Fixed
other
Created
8 months ago
v11.0
🇳🇿
New Zealand
quietone
7 months ago
💬
alexpott's test issue
Active
other
Created
over 9 years ago
v11.0
🇬🇧
United Kingdom
alexpott
7 months ago
📌
Ignore phpstan-tmp in phpcs.xml.dist
Fixed
other
Created
8 months ago
v11.0
🇬🇧
United Kingdom
longwave
7 months ago
📌
Fix 6 spelling words in tests
Fixed
other
Created
8 months ago
v11.0
🇳🇿
New Zealand
quietone
7 months ago
🌱
[meta] Fix missing hyphens for prefixes - Words starting with "un"
Active
other
Created
about 3 years ago
v11.0
🇧🇷
Brazil
andregp
8 months ago
📌
Fix TestSiteApplicationTest::testUserLogin to properly test user login
Active
other
Created
over 1 year ago
v11.0
🇳🇿
New Zealand
quietone
8 months ago
🐛
New throbber SVG images lack xmlns attribute
Fixed
other
Created
8 months ago
v11.0
🇯🇵
Japan
tom konda
8 months ago
🌱
[meta] Replace http urls with https urls of the respective sites in core
Active
other
Created
over 1 year ago
v11.0
🇮🇳
India
bhanu951
8 months ago
📌
More spelling fixes, 22 words, in tests
Fixed
other
Created
9 months ago
v11.0
🇳🇿
New Zealand
quietone
8 months ago
🌱
[meta] Add compatibility for the latest major and minor versions of dependencies to Drupal 10
Fixed
other
Created
about 3 years ago
v11.0
🇺🇸
United States
xjm
8 months ago
🌱
[meta] Requirements for tagging 11.0.0
Fixed
other
Created
about 2 years ago
v11.0
🇺🇸
United States
xjm
8 months ago
📌
Fix missing hyphens for prefixes - Words starting with "de"
Active
other
Created
about 3 years ago
v11.0
🇧🇷
Brazil
andregp
8 months ago
📌
Update URL to HTTPS in .editorconfig
Needs work
other
Created
8 months ago
v11.0
solideogloria
8 months ago
✨
Use proper "password" wording instead of "pass"
Closed: works as designed
other
Created
almost 10 years ago
v11.0
mbkaba22
8 months ago
📌
Hyphenate 4 words that start with 'un'
Needs work
other
Created
over 1 year ago
v11.0
🇺🇸
United States
bhumboldt
8 months ago
🐛
Warning: Undefined array key 1 in Drupal\Core\Asset\LibraryDependencyResolver->doGetDependencies()
Closed: duplicate
other
Created
over 2 years ago
v11.0
🇯🇴
Jordan
Mustafa-salameh
8 months ago
📌
[meta] Remove the last $op params from our hooks
Active
other
Created
about 14 years ago
v11.0
🇧🇪
Belgium
aspilicious
8 months ago
🐛
Extend IIS web.config to allow colons in URLs
Closed: won't fix
other
Created
over 7 years ago
v10.1
🇨🇭
Switzerland
das-peter
8 months ago
📌
Resync .gitlab-ci.yml and .gitignore following Yarn 4 in 11.x
Fixed
other
Created
about 1 year ago
v10.3
🇬🇧
United Kingdom
longwave
8 months ago
🐛
<data> element stripped by $adminTags
Needs work
other
Created
about 2 years ago
v11.0
🇨🇦
Canada
minoroffense
8 months ago
📌
Replace t() calls inside of Controllers that do not use StringTranslationTrait
Fixed
other
Created
over 2 years ago
v10.3
🇮🇳
India
rakesh.drupal
8 months ago
🐛
Prevent phpcs from checking phpstan-tmp
Active
other
Created
8 months ago
v11.0
🇳🇿
New Zealand
quietone
8 months ago
📌
Normalize on fixtures/ directory name for tests
Active
other
Created
about 7 years ago
v11.0
🇺🇸
United States
mile23
8 months ago
🐛
Fix instances of ints passed to functions expecting strings
Fixed
other
Created
9 months ago
v10.4
🇦🇺
Australia
mstrelan
8 months ago
🌱
[meta] Release preparation steps for 11.1.0
Closed: duplicate
other
Created
8 months ago
v11.0
🇳🇿
New Zealand
quietone
8 months ago
📌
Release announcements should show up in Google over release notes
Active
other
Created
11 months ago
v11.0
🇭🇺
Hungary
Gábor Hojtsy
8 months ago
🌱
[12.x] [meta] Add compatibility for the latest minor and major dependency versions in Drupal 11
Active
other
Created
8 months ago
v11.0
🇺🇸
United States
xjm
8 months ago
📌
11.1.0 release notes
Closed: duplicate
other
Created
8 months ago
v11.0
🇳🇿
New Zealand
quietone
8 months ago
🐛
Get better error reporting from __toString
Fixed
other
Created
over 9 years ago
v8.0
🇨🇦
Canada
chx
8 months ago
📌
Quote consistency in .info.yml files for Core modules
Active
other
Created
over 6 years ago
v11.0
🇺🇸
United States
volkswagenchick
8 months ago
📌
Remove description from @return $this
Postponed
other
Created
almost 5 years ago
v11.0
🇨🇳
China
jungle
8 months ago
📌
Follow code style for complex hooks
Postponed
other
Created
almost 8 years ago
v11.0
🇳🇱
Netherlands
clemens.tolboom
8 months ago
📌
[policy] Determine design for forms that have multiple actions
Active
other
Created
8 months ago
v11.0
🇳🇿
New Zealand
quietone
8 months ago
📌
Fix 'Drupal.Commenting.InlineComment.NotCapital' coding standard
Fixed
other
Created
almost 9 years ago
v10.3
🇫🇷
France
andypost
8 months ago
📌
In FieldPluginBase Rename Views properties to core standards
Active
other
Created
over 11 years ago
v11.0
🇺🇸
United States
yesct
8 months ago
📌
In StylePluginBase Rename Views properties to core standards
Active
other
Created
about 2 years ago
v11.0
🇫🇷
France
andypost
8 months ago
📌
In WizardPluginBase Rename Views properties to core standards
Active
other
Created
over 11 years ago
v11.0
🇧🇷
Brazil
Mac_Weber
8 months ago
🐛
After clicking the expand button, the dialog does not update its position in real-time
Needs work
other
Created
8 months ago
v11.0
Mark Shi
8 months ago
🐛
Validatable config job is broken when MR introduces new dependencies
Active
other
Created
8 months ago
v11.0
🇦🇺
Australia
mstrelan
8 months ago
💬
security support after Drupal9 EOL
Fixed
other
Created
over 1 year ago
v11.0
🇫🇷
France
matoeil
8 months ago
✨
Enable NestedArray to process nested arrays iteratively instead of recursively.
Needs work
other
Created
almost 6 years ago
v11.0
🇺🇸
United States
c7bamford
8 months ago
🐛
Fix instances of floats passed to functions expecting ints
Fixed
other
Created
9 months ago
v10.3
🇦🇺
Australia
mstrelan
8 months ago
📌
Remove unused variables in catch statements
Fixed
other
Created
about 1 year ago
v11.0
🇦🇺
Australia
mstrelan
8 months ago
📌
[meta] Fix 'Drupal.NamingConventions.ValidFunctionName' coding standard
Active
other
Created
about 5 years ago
v11.0
🇨🇳
China
jungle
8 months ago
📌
Public method name "EntityField::render_item" is not | | in lowerCamel format
Active
other
Created
about 4 years ago
v11.0
🇮🇳
India
Jeya sundhar
8 months ago
📌
Fix Drupal.Functions.MultiLineFunctionDeclaration coding standard
Fixed
other
Created
12 months ago
v11.0
🇳🇱
Netherlands
bbrala
8 months ago
📌
[META] Many core class names violate naming standards
Postponed
other
Created
over 12 years ago
v11.0
🇺🇸
United States
jhodgdon
8 months ago
💬
Nodes suddenly gone, only the node author stay in the admin/content page
Closed: outdated
other
Created
over 1 year ago
v11.0
🇬🇧
United Kingdom
freelylw
8 months ago
💬
Site dead after upgrade from 9.x to 10.x
Closed: outdated
other
Created
over 1 year ago
v11.0
🇬🇧
United Kingdom
freelylw
8 months ago
💬
How to stop all the urls redirecting from ?abc to ?abc=
Closed: outdated
other
Created
about 1 year ago
v10.3
🇮🇳
India
rajesh190888
8 months ago
💬
Uncaught PHP Exception TypeError
Closed: outdated
other
Created
10 months ago
v10.2
🇪🇬
Egypt
itmohameddrupal2011
8 months ago
💬
drush updatedb returns error
Closed: outdated
other
Created
about 1 year ago
v10.2
pja
8 months ago
💬
How to build a table in custom module's form, take inputs from user, save it and render it on node?
Closed: outdated
other
Created
10 months ago
v10.4
mrit4406
8 months ago
📌
Fix 'Drupal.Commenting.DocComment.ClassMissingShort' in non tests
Active
other
Created
almost 5 years ago
v11.0
🇨🇳
China
jungle
8 months ago
✨
Drupal History Project Actions Import and Export
Closed: won't fix
other
Created
over 11 years ago
v11.0
🇬🇧
United Kingdom
charlie charles
8 months ago
contrib
.social
Blog
FAQ
Discussions
Production build 0.71.5
2024