@nws_engineering

Account created on 7 March 2025, about 1 month ago
#

Recent comments

Hi there,
can anyone say why it fails?

patch -p1 -f < ../11169.patch
patching file core/modules/system/tests/modules/hook_collector_skip_procedural_attribute/hook_collector_skip_procedural_attribute.module
Hunk #1 succeeded at 12 with fuzz 2 (offset 3 lines).
The next patch would create the file core/tests/Drupal/FunctionalTests/Hook/HookCollectorPassTest.php,
which already exists! Applying it anyway.
patching file core/tests/Drupal/FunctionalTests/Hook/HookCollectorPassTest.php
Hunk #1 FAILED at 1.
1 out of 1 hunk FAILED -- saving rejects to file core/tests/Drupal/FunctionalTests/Hook/HookCollectorPassTest.php.rej
patching file core/lib/Drupal/Core/Extension/ModuleHandler.php
Hunk #1 FAILED at 189.
1 out of 1 hunk FAILED -- saving rejects to file core/lib/Drupal/Core/Extension/ModuleHandler.php.rej
patching file core/lib/Drupal/Core/Hook/HookCollectorPass.php
Hunk #1 FAILED at 179.
Hunk #2 FAILED at 329.
2 out of 2 hunks FAILED -- saving rejects to file core/lib/Drupal/Core/Hook/HookCollectorPass.php.rej
The next patch would create the file core/modules/config/tests/config_test/config_test.module,
which already exists! Applying it anyway.
patching file core/modules/config/tests/config_test/config_test.module
Hunk #1 FAILED at 1.
1 out of 1 hunk FAILED -- saving rejects to file core/modules/config/tests/config_test/config_test.module.rej
patching file core/tests/Drupal/FunctionalTests/Hook/HookCollectorPassTest.php
Hunk #1 FAILED at 14.
Hunk #2 FAILED at 24.
2 out of 2 hunks FAILED -- saving rejects to file core/tests/Drupal/FunctionalTests/Hook/HookCollectorPassTest.php.rej
patching file core/modules/config/tests/config_test/config_test.module
Hunk #1 FAILED at 1.
1 out of 1 hunk FAILED -- saving rejects to file core/modules/config/tests/config_test/config_test.module.rej
patching file core/modules/config/tests/config_test/config_test.module
Hunk #1 FAILED at 1.
1 out of 1 hunk FAILED -- saving rejects to file core/modules/config/tests/config_test/config_test.module.rej
patching file core/modules/system/tests/modules/hook_collector_skip_procedural_attribute/hook_collector_skip_procedural_attribute.module
Hunk #1 succeeded at 12 with fuzz 2 (offset 3 lines).
patching file core/tests/Drupal/FunctionalTests/Hook/HookCollectorPassTest.php
Hunk #1 FAILED at 43.
1 out of 1 hunk FAILED -- saving rejects to file core/tests/Drupal/FunctionalTests/Hook/HookCollectorPassTest.php.rej
patching file core/modules/system/tests/modules/container_no_function/container_no_function.info.yml
patching file core/modules/system/tests/modules/container_no_function/container_no_function.module (renamed from core/modules/config/tests/config_test/config_test.module)
patching file core/modules/system/tests/src/Functional/Hook/HookCollectorPassTest.php (renamed from core/tests/Drupal/FunctionalTests/Hook/HookCollectorPassTest.php)
Cannot rename file without two valid file names

Production build 0.71.5 2024